OpenHarmony
type: Concept
definition: OpenAtom財団(開放原子開源基金会)が育成・運営する、全シナリオのスマートデバイス向けオープンソース分散OSフレームワーク。カーネル層・システムサービス層・フレームワーク層・アプリケーション層の4層構造を持つ。
alternative label: 开源鸿蒙
narrower: liteos-m
narrower: liteos-a
narrower: lightweight-system
narrower: small-system
narrower: standard-system
narrower: openharmony-release-branch
narrower: openharmony-lts-branch
implements: lightweight-system
implements: standard-system
implements: small-system
uses: hdf
uses: deveco-device-tool
uses: gn-ninja
uses: repo-tool
uses: kal
uses: distributed-softbus
uses: ability-framework
uses: openharmony-release-branch
uses: openharmony-lts-branch
uses: api-level
incompatible with: windows-app-assets
incompatible with: appgallery
incompatible with: hms
verified by: device-qemu
subject of: article
requires: openatom-foundation