Releaseブランチ
type: Concept
definition: OpenHarmonyコミュニティの通常保守ブランチ。生命周期は2年(主動保守1年+受動保守1年)。
alternative label: Release branch
broader: openharmony
not recommended for: long-lifecycle-equipment
subject of: article