.NETスレッドプール
type: Concept
definition: .NETランタイムが提供する、ワーカースレッドとI/O完了スレッドの2階建てのスレッドプール。非同期I/Oのハンドルは内部で自前のI/O完了ポートに結び付けられる。
alternative label: managed thread pool
narrower: worker-thread-dotnet
narrower: io-completion-thread-dotnet
subject of: article
uses: iocp
uses: worker-thread-dotnet
uses: io-completion-thread-dotnet
verified by: getavailablethreads-dotnet